Reaction Details
TargetRAC-alpha serine/threonine-protein kinase
LigandBDBM50170423
Substrate/Competitorn/a
Meas. Tech.ChEMBL_1577690 (CHEMBL3807471)
IC50 1480±n/a nM
Citation Zhan, WXu, LDong, XDong, JYi, XMa, XQiu, NLi, JYang, BZhou, YHu, Y Design, synthesis and biological evaluation of pyrazol-furan carboxamide analogues as novel Akt kinase inhibitors. Eur J Med Chem117:47-58 (2016) 
 
RAC-alpha serine/threonine-protein kinase
Name:RAC-alpha serine/threonine-protein kinase
Type:Enzyme
Mol. Mass.:55681.25
Organism:Homo sapiens (Human)
Description:P31749
Residue:480
BDBM50170423
NameBDBM50170423
Synonyms:CHEMBL3805457
TypeSmall organic molecule
Emp. Form.C20H18BrCl3N4O2
Mol. Mass.532.646
SMILESCn1ncc(Cl)c1-c1oc(cc1Br)C(=O)NC1(CCNCC1)c1ccc(Cl)c(Cl)c1