Reaction Details
TargetMast/stem cell growth factor receptor Kit
LigandBDBM50173334
Substrate/Competitorn/a
Meas. Tech.ChEMBL_1579232 (CHEMBL3812312)
IC50 99±n/a nM
Citation Wang, QLiu, FWang, BZou, FChen, CLiu, XWang, AQi, SWang, WQi, ZZhao, ZHu, ZWang, WWang, LZhang, SWang, YLiu, JLiu, Q Discovery of N-(3-((1-Isonicotinoylpiperidin-4-yl)oxy)-4-methylphenyl)-3-(trifluoromethyl)benzamide (CHMFL-KIT-110) as a Selective, Potent, and Orally Available Type II c-KIT Kinase Inhibitor for Gastrointestinal Stromal Tumors (GISTs). J Med Chem59:3964-79 (2016) 
 
Mast/stem cell growth factor receptor Kit
Name:Mast/stem cell growth factor receptor Kit
Type:Protein
Mol. Mass.:109869.37
Organism:Homo sapiens (Human)
Description:P10721
Residue:976
BDBM50173334
NameBDBM50173334
Synonyms:CHEMBL3809935
TypeSmall organic molecule
Emp. Form.C26H24F3N3O3
Mol. Mass.483.4823
SMILESCc1ccc(NC(=O)c2cccc(c2)C(F)(F)F)cc1OC1CCN(CC1)C(=O)c1ccncc1