Reaction Details
TargetKappa-type opioid receptor
LigandBDBM50175274
Substrate/Competitorn/a
Meas. Tech.ChEMBL_1580641 (CHEMBL3810954)
EC50 1500±n/a nM
Citation Nakai, TPerl, NRBarden, TCCarvalho, AFretzen, AGermano, PIm, GYJin, HKim, CLee, TWLong, KMoore, JRohde, JMSarno, RSegal, CSolberg, EOTobin, JZimmer, DPCurrie, MG Discovery of IWP-051, a Novel Orally Bioavailable sGC Stimulator with Once-Daily Dosing Potential in Humans. ACS Med Chem Lett7:465-9 (2016) 
 
Kappa-type opioid receptor
Name:Kappa-type opioid receptor
Type:G Protein-Coupled Receptor (GPCR)
Mol. Mass.:42648.76
Organism:Homo sapiens (Human)
Description:P41145
Residue:380
BDBM50175274
NameBDBM50175274
Synonyms:CHEMBL3809864 | US10189809, Compound I-97
TypeSmall organic molecule
Emp. Form.C17H13FN6O
Mol. Mass.336.3231
SMILESNc1ccnc(n1)-c1cc(-c2ccon2)n(Cc2ccccc2F)n1