Reaction Details
TargetBromodomain-containing protein 4
LigandBDBM50178205
Substrate/Competitorn/a
Meas. Tech.ChEMBL_1582082 (CHEMBL3817159)
IC50>200000±n/a nM
Citation Taylor, AMCôté, AHewitt, MCPastor, RLeblanc, YNasveschuk, CGRomero, FACrawford, TDCantone, NJayaram, HSetser, JMurray, JBeresini, MHde Leon Boenig, GChen, ZConery, ARCummings, RTDakin, LAFlynn, EMHuang, OWKaufman, SKeller, PJKiefer, JRLai, TLi, YLiao, JLiu, WLu, HPardo, ETsui, VWang, JWang, YXu, ZYan, FYu, DZawadzke, LZhu, XZhu, XSims, RJCochran, AGBellon, SAudia, JEMagnuson, SAlbrecht, BK Fragment-Based Discovery of a Selective and Cell-Active Benzodiazepinone CBP/EP300 Bromodomain Inhibitor (CPI-637). ACS Med Chem Lett7:531-6 (2016) 
 
Bromodomain-containing protein 4
Name:Bromodomain-containing protein 4
Type:Protein
Mol. Mass.:152264.84
Organism:Homo sapiens (Human)
Description:O60885
Residue:1362
BDBM50178205
NameBDBM50178205
Synonyms:CHEMBL3813890
TypeSmall organic molecule
Emp. Form.C10H12N2O
Mol. Mass.176.2151
SMILESCC1CNc2ccccc2NC1=O