Reaction Details
TargetCREB-binding protein
LigandBDBM50178180
Substrate/Competitorn/a
Meas. Tech.ChEMBL_1582080 (CHEMBL3817157)
IC50 6500±n/a nM
Citation Taylor, AMCôté, AHewitt, MCPastor, RLeblanc, YNasveschuk, CGRomero, FACrawford, TDCantone, NJayaram, HSetser, JMurray, JBeresini, MHde Leon Boenig, GChen, ZConery, ARCummings, RTDakin, LAFlynn, EMHuang, OWKaufman, SKeller, PJKiefer, JRLai, TLi, YLiao, JLiu, WLu, HPardo, ETsui, VWang, JWang, YXu, ZYan, FYu, DZawadzke, LZhu, XZhu, XSims, RJCochran, AGBellon, SAudia, JEMagnuson, SAlbrecht, BK Fragment-Based Discovery of a Selective and Cell-Active Benzodiazepinone CBP/EP300 Bromodomain Inhibitor (CPI-637). ACS Med Chem Lett7:531-6 (2016) 
 
CREB-binding protein
Name:CREB-binding protein
Type:Transcription Coactivator
Mol. Mass.:265411.66
Organism:Homo sapiens (Human)
Description:Q92793
Residue:2442
BDBM50178180
NameBDBM50178180
Synonyms:CHEMBL3815086
TypeSmall organic molecule
Emp. Form.C15H16N4O3
Mol. Mass.300.3125
SMILESC[C@@H]1CC(=O)Nc2cccc(C(=O)NCc3cnco3)c2N1