Reaction Details
TargetCREB-binding protein
LigandBDBM50178161
Substrate/Competitorn/a
Meas. Tech.ChEMBL_1582084 (CHEMBL3817161)
EC50 1900±n/a nM
Citation Taylor, AMCôté, AHewitt, MCPastor, RLeblanc, YNasveschuk, CGRomero, FACrawford, TDCantone, NJayaram, HSetser, JMurray, JBeresini, MHde Leon Boenig, GChen, ZConery, ARCummings, RTDakin, LAFlynn, EMHuang, OWKaufman, SKeller, PJKiefer, JRLai, TLi, YLiao, JLiu, WLu, HPardo, ETsui, VWang, JWang, YXu, ZYan, FYu, DZawadzke, LZhu, XZhu, XSims, RJCochran, AGBellon, SAudia, JEMagnuson, SAlbrecht, BK Fragment-Based Discovery of a Selective and Cell-Active Benzodiazepinone CBP/EP300 Bromodomain Inhibitor (CPI-637). ACS Med Chem Lett7:531-6 (2016) 
 
CREB-binding protein
Name:CREB-binding protein
Type:Transcription Coactivator
Mol. Mass.:265411.66
Organism:Homo sapiens (Human)
Description:Q92793
Residue:2442
BDBM50178161
NameBDBM50178161
Synonyms:CHEMBL3813929
TypeSmall organic molecule
Emp. Form.C19H19N5O2
Mol. Mass.349.3865
SMILESC[C@@H]1CC(=O)Nc2cccc(-c3ccc4n(C)nc(C(N)=O)c4c3)c2N1