Reaction Details
TargetBromodomain-containing protein 4
LigandBDBM50178221
Substrate/Competitorn/a
Meas. Tech.ChEMBL_1582082 (CHEMBL3817159)
IC50>20000±n/a nM
Citation Taylor, AMCôté, AHewitt, MCPastor, RLeblanc, YNasveschuk, CGRomero, FACrawford, TDCantone, NJayaram, HSetser, JMurray, JBeresini, MHde Leon Boenig, GChen, ZConery, ARCummings, RTDakin, LAFlynn, EMHuang, OWKaufman, SKeller, PJKiefer, JRLai, TLi, YLiao, JLiu, WLu, HPardo, ETsui, VWang, JWang, YXu, ZYan, FYu, DZawadzke, LZhu, XZhu, XSims, RJCochran, AGBellon, SAudia, JEMagnuson, SAlbrecht, BK Fragment-Based Discovery of a Selective and Cell-Active Benzodiazepinone CBP/EP300 Bromodomain Inhibitor (CPI-637). ACS Med Chem Lett7:531-6 (2016) 
 
Bromodomain-containing protein 4
Name:Bromodomain-containing protein 4
Type:Protein
Mol. Mass.:152264.84
Organism:Homo sapiens (Human)
Description:O60885
Residue:1362
BDBM50178221
NameBDBM50178221
Synonyms:CHEMBL3814602
TypeSmall organic molecule
Emp. Form.C19H17N5O
Mol. Mass.331.3712
SMILESC[C@@H]1CC(=O)Nc2cccc(-c3ccc4n(C)nc(C#N)c4c3)c2N1