Reaction Details
TargetLanosterol synthase
LigandBDBM50180952
Substrate/Competitorn/a
Meas. Tech.ChEMBL_1585258 (CHEMBL3821389)
IC50 179±n/a nM
Citation von Kleist, LMichaelis, SBartho, KGraebner, OSchlief, MDreger, MSchrey, AKSefkow, MKroll, FKoester, HLuo, Y Identification of Potential Off-target Toxicity Liabilities of Catechol-O-methyltransferase Inhibitors by Differential Competition Capture Compound Mass Spectrometry. J Med Chem59:4664-75 (2016) 
 
Lanosterol synthase
Name:Lanosterol synthase
Type:PROTEIN
Mol. Mass.:83302.12
Organism:Rattus norvegicus
Description:ChEMBL_12083
Residue:733
BDBM50180952
NameBDBM50180952
Synonyms:CHEMBL3818350
TypeSmall organic molecule
Emp. Form.C12H10N2O6S
Mol. Mass.310.283
SMILESCCN1C(=O)S\C(=C\c2cc(O)c(O)c(c2)[N+]([O-])=O)C1=O