Reaction Details
TargetC-X-C chemokine receptor type 2
LigandBDBM50182261
Substrate/Competitorn/a
Meas. Tech.ChEMBL_1585799 (CHEMBL3821596)
IC50 10.0±n/a nM
Citation Xu, HLu, HXu, ZLuan, LLi, CXu, YDong, KZhang, JLi, XLi, YLiu, GGong, SZhao, YGLiu, AZhang, YZhang, WCai, XXiang, JNElliott, JDLin, X Discovery of CNS Penetrant CXCR2 Antagonists for the Potential Treatment of CNS Demyelinating Disorders. ACS Med Chem Lett7:397-402 (2016) 
 
C-X-C chemokine receptor type 2
Name:C-X-C chemokine receptor type 2
Type:Protein
Mol. Mass.:40767.88
Organism:Homo sapiens (Human)
Description:P25025
Residue:360
BDBM50182261
NameBDBM50182261
Synonyms:CHEMBL3817880
TypeSmall organic molecule
Emp. Form.C19H20Cl3N3O5S
Mol. Mass.508.803
SMILESC[C@H]1CN(C[C@@H](C)O1)S(=O)(=O)c1c(Cl)ccc(NC(=O)Nc2cccc(Cl)c2Cl)c1O