Reaction Details
TargetC-X-C chemokine receptor type 2
LigandBDBM50182277
Substrate/Competitorn/a
Meas. Tech.ChEMBL_1585799 (CHEMBL3821596)
IC50 1.000000±n/a nM
Citation Xu, HLu, HXu, ZLuan, LLi, CXu, YDong, KZhang, JLi, XLi, YLiu, GGong, SZhao, YGLiu, AZhang, YZhang, WCai, XXiang, JNElliott, JDLin, X Discovery of CNS Penetrant CXCR2 Antagonists for the Potential Treatment of CNS Demyelinating Disorders. ACS Med Chem Lett7:397-402 (2016) 
 
C-X-C chemokine receptor type 2
Name:C-X-C chemokine receptor type 2
Type:Protein
Mol. Mass.:40767.88
Organism:Homo sapiens (Human)
Description:P25025
Residue:360
BDBM50182277
NameBDBM50182277
Synonyms:CHEMBL3818323
TypeSmall organic molecule
Emp. Form.C18H16Cl2FN3O3
Mol. Mass.412.242
SMILESOc1c(NC(=O)Nc2cccc(F)c2Cl)ccc(Cl)c1C(=O)N1CCCC1