Reaction Details
TargetPotassium voltage-gated channel subfamily H member 2
LigandBDBM50182250
Substrate/Competitorn/a
Meas. Tech.ChEMBL_1585823 (CHEMBL3821620)
IC50<79433±n/a nM
Citation Xu, HLu, HXu, ZLuan, LLi, CXu, YDong, KZhang, JLi, XLi, YLiu, GGong, SZhao, YGLiu, AZhang, YZhang, WCai, XXiang, JNElliott, JDLin, X Discovery of CNS Penetrant CXCR2 Antagonists for the Potential Treatment of CNS Demyelinating Disorders. ACS Med Chem Lett7:397-402 (2016) 
 
Potassium voltage-gated channel subfamily H member 2
Name:Potassium voltage-gated channel subfamily H member 2
Type:Multi-pass membrane protein
Mol. Mass.:126672.65
Organism:Homo sapiens (Human)
Description:Q12809
Residue:1159
BDBM50182250
NameBDBM50182250
Synonyms:CHEMBL3819521
TypeSmall organic molecule
Emp. Form.C19H20Cl3N3O4S
Mol. Mass.492.804
SMILESCN1CCC(CC1)S(=O)(=O)c1c(Cl)ccc(NC(=O)Nc2cccc(Cl)c2Cl)c1O