Reaction Details
TargetC-X-C chemokine receptor type 2
LigandBDBM50182264
Substrate/Competitorn/a
Meas. Tech.ChEMBL_1585800 (CHEMBL3821597)
IC50 158±n/a nM
Citation Xu, HLu, HXu, ZLuan, LLi, CXu, YDong, KZhang, JLi, XLi, YLiu, GGong, SZhao, YGLiu, AZhang, YZhang, WCai, XXiang, JNElliott, JDLin, X Discovery of CNS Penetrant CXCR2 Antagonists for the Potential Treatment of CNS Demyelinating Disorders. ACS Med Chem Lett7:397-402 (2016) 
 
C-X-C chemokine receptor type 2
Name:C-X-C chemokine receptor type 2
Type:Protein
Mol. Mass.:40767.88
Organism:Homo sapiens (Human)
Description:P25025
Residue:360
BDBM50182264
NameBDBM50182264
Synonyms:CHEMBL3818216
TypeSmall organic molecule
Emp. Form.C16H15Cl3N2O4S
Mol. Mass.437.725
SMILESCC(C)S(=O)(=O)c1c(Cl)ccc(NC(=O)Nc2cccc(Cl)c2Cl)c1O