Reaction Details
TargetProtein-S-isoprenylcysteine O-methyltransferase
LigandBDBM50183445
Substrate/Competitorn/a
Meas. Tech.ChEMBL_1586735 (CHEMBL3825052)
IC50 7700±n/a nM
Citation Butler, KVBohn, KHrycyna, CAJin, J Non-Substrate Based, Small Molecule Inhibitors of the Human Isoprenylcysteine Carboxyl Methyltransferase. Medchemcomm7:1016-1021 (2016) Protein-S-isoprenylcysteine O-methyltransferase
Name:Protein-S-isoprenylcysteine O-methyltransferase
Type:PROTEIN
Mol. Mass.:31943.26
Organism:Homo sapiens (Human)
Description:ChEMBL_956034
Residue:284
BDBM50183445
NameBDBM50183445
Synonyms:CHEMBL3822621
TypeSmall organic molecule
Emp. Form.C20H18O2S
Mol. Mass.322.421
SMILES[#8]-c1c(ccc2ccccc12)-[#6](\c1cccs1)=[#6]-1/[#6]-[#6]-[#8]-[#6]-[#6]-1