Reaction Details
TargetProtein-S-isoprenylcysteine O-methyltransferase
LigandBDBM50183447
Substrate/Competitorn/a
Meas. Tech.ChEMBL_1586735 (CHEMBL3825052)
IC50 14000±n/a nM
Citation Butler, KVBohn, KHrycyna, CAJin, J Non-Substrate Based, Small Molecule Inhibitors of the Human Isoprenylcysteine Carboxyl Methyltransferase. Medchemcomm7:1016-1021 (2016) Protein-S-isoprenylcysteine O-methyltransferase
Name:Protein-S-isoprenylcysteine O-methyltransferase
Type:PROTEIN
Mol. Mass.:31943.26
Organism:Homo sapiens (Human)
Description:ChEMBL_956034
Residue:284
BDBM50183447
NameBDBM50183447
Synonyms:CHEMBL3823076
TypeSmall organic molecule
Emp. Form.C19H19NO2S
Mol. Mass.325.425
SMILESOc1c(ccc2cccnc12)C(C1CCOCC1)c1cccs1