Reaction Details
TargetPotassium voltage-gated channel subfamily H member 2
LigandBDBM50184455
Substrate/Competitorn/a
Meas. Tech.ChEMBL_1586953 (CHEMBL3825087)
IC50 9300±n/a nM
Citation Degorce, SLBoyd, SCurwen, JODucray, RHalsall, CTJones, CDLach, FLenz, EMPass, MPass, STrigwell, C Discovery of a Potent, Selective, Orally Bioavailable, and Efficacious Novel 2-(Pyrazol-4-ylamino)-pyrimidine Inhibitor of the Insulin-like Growth Factor-1 Receptor (IGF-1R). J Med Chem59:4859-66 (2016) 
 
Potassium voltage-gated channel subfamily H member 2
Name:Potassium voltage-gated channel subfamily H member 2
Type:Multi-pass membrane protein
Mol. Mass.:126672.65
Organism:Homo sapiens (Human)
Description:Q12809
Residue:1159
BDBM50184455
NameBDBM50184455
Synonyms:CHEMBL3824323
TypeSmall organic molecule
Emp. Form.C23H27ClN8O
Mol. Mass.466.966
SMILESCc1nn(C2CCN(CCO)CC2)c(C)c1Nc1ncc(Cl)c(n1)-c1cnn2ccccc12