Reaction Details
TargetCytochrome P450 3A4
LigandBDBM50184462
Substrate/Competitorn/a
Meas. Tech.ChEMBL_1587034 (CHEMBL3825430)
IC50 500±n/a nM
Citation Degorce, SLBoyd, SCurwen, JODucray, RHalsall, CTJones, CDLach, FLenz, EMPass, MPass, STrigwell, C Discovery of a Potent, Selective, Orally Bioavailable, and Efficacious Novel 2-(Pyrazol-4-ylamino)-pyrimidine Inhibitor of the Insulin-like Growth Factor-1 Receptor (IGF-1R). J Med Chem59:4859-66 (2016) 
 
Cytochrome P450 3A4
Name:Cytochrome P450 3A4
Type:Enzyme
Mol. Mass.:57349.57
Organism:Homo sapiens (Human)
Description:n/a
Residue:503
BDBM50184462
NameBDBM50184462
Synonyms:CHEMBL3823154
TypeSmall organic molecule
Emp. Form.C23H26ClN9O
Mol. Mass.479.965
SMILESCc1nn(C2CCN(CC2)C(=O)CN)c(C)c1Nc1ncc(Cl)c(n1)-c1cnn2ccccc12