Reaction Details
TargetCyclin-dependent kinase 2
LigandBDBM50184474
Substrate/Competitorn/a
Meas. Tech.ChEMBL_1586950 (CHEMBL3825084)
IC50 361±n/a nM
Citation Degorce, SLBoyd, SCurwen, JODucray, RHalsall, CTJones, CDLach, FLenz, EMPass, MPass, STrigwell, C Discovery of a Potent, Selective, Orally Bioavailable, and Efficacious Novel 2-(Pyrazol-4-ylamino)-pyrimidine Inhibitor of the Insulin-like Growth Factor-1 Receptor (IGF-1R). J Med Chem59:4859-66 (2016) 
 
Cyclin-dependent kinase 2
Name:Cyclin-dependent kinase 2
Type:Enzyme Subunit
Mol. Mass.:33938.17
Organism:Homo sapiens (Human)
Description:P24941
Residue:298
BDBM50184474
NameBDBM50184474
Synonyms:CHEMBL3823522
TypeSmall organic molecule
Emp. Form.C22H23ClN8O2
Mol. Mass.466.923
SMILESCOc1nn(cc1Nc1ncc(Cl)c(n1)-c1cnn2ccccc12)C1CCN(CC1)C(C)=O