Reaction Details
TargetInsulin-like growth factor 1 receptor
LigandBDBM50184463
Substrate/Competitorn/a
Meas. Tech.ChEMBL_1586952 (CHEMBL3825086)
IC50 18±n/a nM
Citation Degorce, SLBoyd, SCurwen, JODucray, RHalsall, CTJones, CDLach, FLenz, EMPass, MPass, STrigwell, C Discovery of a Potent, Selective, Orally Bioavailable, and Efficacious Novel 2-(Pyrazol-4-ylamino)-pyrimidine Inhibitor of the Insulin-like Growth Factor-1 Receptor (IGF-1R). J Med Chem59:4859-66 (2016) 
 
Insulin-like growth factor 1 receptor
Name:Insulin-like growth factor 1 receptor
Type:Protein
Mol. Mass.:154776.79
Organism:Homo sapiens (Human)
Description:P08069
Residue:1367
BDBM50184463
NameBDBM50184463
Synonyms:CHEMBL3824103
TypeSmall organic molecule
Emp. Form.C24H28ClN9O
Mol. Mass.493.992
SMILESC[C@H](N)C(=O)N1CCC(CC1)n1nc(C)c(Nc2ncc(Cl)c(n2)-c2cnn3ccccc23)c1C