Reaction Details
TargetTransient receptor potential cation channel subfamily V member 1
LigandBDBM50049553
Substrate/Competitorn/a
Meas. Tech.ChEMBL_1588585 (CHEMBL3824993)
Ki 7.9±n/a nM
Citation Ann, JSun, WZhou, XJung, ABaek, JLee, SKim, CYoon, SHong, SChoi, STurcios, NAHerold, BKEsch, TELewin, NEAbramovitz, APearce, LVBlumberg, PMLee, J Discovery of N-(3-fluoro-4-methylsulfonamidomethylphenyl)urea as a potent TRPV1 antagonistic template. Bioorg Med Chem Lett26:3603-7 (2016) 
 
Transient receptor potential cation channel subfamily V member 1
Name:Transient receptor potential cation channel subfamily V member 1
Type:Protein
Mol. Mass.:94960.75
Organism:Homo sapiens (Human)
Description:Q8NER1
Residue:839
BDBM50049553
NameBDBM50049553
Synonyms:CHEMBL2177428
TypeSmall organic molecule
Emp. Form.C23H28F4N4O3S
Mol. Mass.516.552
SMILESCC(C(=O)NCc1ccc(nc1N1CCC(C)CC1)C(F)(F)F)c1ccc(NS(C)(=O)=O)c(F)c1