Reaction Details
TargetExtracellular calcium-sensing receptor
LigandBDBM50190153
Substrate/Competitorn/a
Meas. Tech.ChEMBL_1589193 (CHEMBL3829966)
IC50 22±n/a nM
Citation Liang, GBZhou, CHuo, XWang, HYang, XHuang, SWang, HWilkinson, HLuo, LTang, WSutton, DLi, HZaller, DMeinke, PT Discovery of novel dihydrobenzofuran cyclopropane carboxylic acid based calcium sensing receptor antagonists for the treatment of osteoporosis. Bioorg Med Chem Lett26:4077-80 (2016) 
 
Extracellular calcium-sensing receptor
Name:Extracellular calcium-sensing receptor
Type:Protein
Mol. Mass.:120663.13
Organism:Homo sapiens (Human)
Description:P41180
Residue:1078
BDBM50190153
NameBDBM50190153
Synonyms:CHEMBL3828483
TypeSmall organic molecule
Emp. Form.C30H35NO5
Mol. Mass.489.6026
SMILES[H][C@@]12Oc3c(c(ccc3C)[C@@H](C)OC[C@H](O)CNC(C)(C)Cc3ccc4ccccc4c3)[C@]1([H])[C@H]2C(O)=O