Reaction Details
TargetExtracellular calcium-sensing receptor
LigandBDBM50190157
Substrate/Competitorn/a
Meas. Tech.ChEMBL_1589193 (CHEMBL3829966)
IC50 117±n/a nM
Citation Liang, GBZhou, CHuo, XWang, HYang, XHuang, SWang, HWilkinson, HLuo, LTang, WSutton, DLi, HZaller, DMeinke, PT Discovery of novel dihydrobenzofuran cyclopropane carboxylic acid based calcium sensing receptor antagonists for the treatment of osteoporosis. Bioorg Med Chem Lett26:4077-80 (2016) 
 
Extracellular calcium-sensing receptor
Name:Extracellular calcium-sensing receptor
Type:Protein
Mol. Mass.:120663.13
Organism:Homo sapiens (Human)
Description:P41180
Residue:1078
BDBM50190157
NameBDBM50190157
Synonyms:CHEMBL3827912
TypeSmall organic molecule
Emp. Form.C29H37NO5
Mol. Mass.479.6078
SMILESCC(OC[C@H](O)CNC(C)(C)CC1Cc2ccccc2C1)c1ccc(C)c2OC3C(C3c12)C(O)=O