Reaction Details
TargetExtracellular calcium-sensing receptor
LigandBDBM50190159
Substrate/Competitorn/a
Meas. Tech.ChEMBL_1589193 (CHEMBL3829966)
IC50 77±n/a nM
Citation Liang, GBZhou, CHuo, XWang, HYang, XHuang, SWang, HWilkinson, HLuo, LTang, WSutton, DLi, HZaller, DMeinke, PT Discovery of novel dihydrobenzofuran cyclopropane carboxylic acid based calcium sensing receptor antagonists for the treatment of osteoporosis. Bioorg Med Chem Lett26:4077-80 (2016) 
 
Extracellular calcium-sensing receptor
Name:Extracellular calcium-sensing receptor
Type:Protein
Mol. Mass.:120663.13
Organism:Homo sapiens (Human)
Description:P41180
Residue:1078
BDBM50190159
NameBDBM50190159
Synonyms:CHEMBL3827356
TypeSmall organic molecule
Emp. Form.C26H31ClFNO5
Mol. Mass.491.979
SMILES[H][C@@]12Oc3c(c(ccc3C)[C@@H](C)OC[C@H](O)CNC(C)(C)Cc3ccc(Cl)c(F)c3)[C@]1([H])[C@H]2C(O)=O