Reaction Details
TargetPlatelet-derived growth factor receptor beta
LigandBDBM50191979
Substrate/Competitorn/a
Meas. Tech.ChEMBL_1613238 (CHEMBL3855038)
IC50 12±n/a nM
Citation Shaw, DEBaig, FBruce, IChamoin, SCollingwood, SPCross, SDayal, SDrückes, PFuret, PFurminger, VHaggart, DHussey, MKonstantinova, ILoren, JCMolteni, VRoberts, SReilly, JSaunders, AMStringer, RSviridenko, LThomas, MThomson, CGTomlins, CWen, BYeh, VPearce, AC Optimization of Platelet-Derived Growth Factor Receptor (PDGFR) Inhibitors for Duration of Action, as an Inhaled Therapy for Lung Remodeling in Pulmonary Arterial Hypertension. J Med Chem59:7901-14 (2016) 
 
Platelet-derived growth factor receptor beta
Name:Platelet-derived growth factor receptor beta
Type:PROTEIN
Mol. Mass.:122794.58
Organism:Rattus norvegicus
Description:ChEMBL_177425
Residue:1097
BDBM50191979
NameBDBM50191979
Synonyms:CHEMBL3906976
TypeSmall organic molecule
Emp. Form.C23H20N4O2
Mol. Mass.384.4305
SMILESCc1ccc(cc1NC(=O)c1cnn2ccccc12)C(=O)NCc1ccccc1