Reaction Details
TargetPlatelet-derived growth factor receptor alpha
LigandBDBM50191945
Substrate/Competitorn/a
Meas. Tech.ChEMBL_1613237 (CHEMBL3855037)
IC50 0.090000±n/a nM
Citation Shaw, DEBaig, FBruce, IChamoin, SCollingwood, SPCross, SDayal, SDrückes, PFuret, PFurminger, VHaggart, DHussey, MKonstantinova, ILoren, JCMolteni, VRoberts, SReilly, JSaunders, AMStringer, RSviridenko, LThomas, MThomson, CGTomlins, CWen, BYeh, VPearce, AC Optimization of Platelet-Derived Growth Factor Receptor (PDGFR) Inhibitors for Duration of Action, as an Inhaled Therapy for Lung Remodeling in Pulmonary Arterial Hypertension. J Med Chem59:7901-14 (2016) 
 
Platelet-derived growth factor receptor alpha
Name:Platelet-derived growth factor receptor alpha
Type:Protein
Mol. Mass.:122633.38
Organism:Homo sapiens (Human)
Description:P16234
Residue:1089
BDBM50191945
NameBDBM50191945
Synonyms:CHEMBL3904768
TypeSmall organic molecule
Emp. Form.C26H19F3N6O2
Mol. Mass.504.4633
SMILESCn1nccc1-c1ccn2c(cnc2c1)C(=O)Nc1cc(ccc1F)C(=O)NCc1ccc(F)c(F)c1