Reaction Details
TargetPlatelet-derived growth factor receptor alpha
LigandBDBM50191978
Substrate/Competitorn/a
Meas. Tech.ChEMBL_1613237 (CHEMBL3855037)
IC50 0.200000±n/a nM
Citation Shaw, DEBaig, FBruce, IChamoin, SCollingwood, SPCross, SDayal, SDrückes, PFuret, PFurminger, VHaggart, DHussey, MKonstantinova, ILoren, JCMolteni, VRoberts, SReilly, JSaunders, AMStringer, RSviridenko, LThomas, MThomson, CGTomlins, CWen, BYeh, VPearce, AC Optimization of Platelet-Derived Growth Factor Receptor (PDGFR) Inhibitors for Duration of Action, as an Inhaled Therapy for Lung Remodeling in Pulmonary Arterial Hypertension. J Med Chem59:7901-14 (2016) 
 
Platelet-derived growth factor receptor alpha
Name:Platelet-derived growth factor receptor alpha
Type:Protein
Mol. Mass.:122633.38
Organism:Homo sapiens (Human)
Description:P16234
Residue:1089
BDBM50191978
NameBDBM50191978
Synonyms:CHEMBL3915941
TypeSmall organic molecule
Emp. Form.C27H32N8O2
Mol. Mass.500.5954
SMILESCc1ncc(cc1NC(=O)c1cnn2cc(ccc12)-c1cnn(C)c1)C(=O)NCCN1CCCC1(C)C