Reaction Details
TargetPlatelet-derived growth factor receptor alpha
LigandBDBM50191976
Substrate/Competitorn/a
Meas. Tech.ChEMBL_1613237 (CHEMBL3855037)
IC50 3.2±n/a nM
Citation Shaw, DEBaig, FBruce, IChamoin, SCollingwood, SPCross, SDayal, SDrückes, PFuret, PFurminger, VHaggart, DHussey, MKonstantinova, ILoren, JCMolteni, VRoberts, SReilly, JSaunders, AMStringer, RSviridenko, LThomas, MThomson, CGTomlins, CWen, BYeh, VPearce, AC Optimization of Platelet-Derived Growth Factor Receptor (PDGFR) Inhibitors for Duration of Action, as an Inhaled Therapy for Lung Remodeling in Pulmonary Arterial Hypertension. J Med Chem59:7901-14 (2016) 
 
Platelet-derived growth factor receptor alpha
Name:Platelet-derived growth factor receptor alpha
Type:Protein
Mol. Mass.:122633.38
Organism:Homo sapiens (Human)
Description:P16234
Residue:1089
BDBM50191976
NameBDBM50191976
Synonyms:CHEMBL3967097
TypeSmall organic molecule
Emp. Form.C26H30FN7O2
Mol. Mass.491.5605
SMILESCN(CCNC(=O)c1ccc(F)c(NC(=O)c2cnc3cc(ccn23)-c2ccnn2C)c1)C(C)(C)C