Reaction Details
TargetPlatelet-derived growth factor receptor beta
LigandBDBM50191978
Substrate/Competitorn/a
Meas. Tech.ChEMBL_1613238 (CHEMBL3855038)
IC50 13±n/a nM
Citation Shaw, DEBaig, FBruce, IChamoin, SCollingwood, SPCross, SDayal, SDrückes, PFuret, PFurminger, VHaggart, DHussey, MKonstantinova, ILoren, JCMolteni, VRoberts, SReilly, JSaunders, AMStringer, RSviridenko, LThomas, MThomson, CGTomlins, CWen, BYeh, VPearce, AC Optimization of Platelet-Derived Growth Factor Receptor (PDGFR) Inhibitors for Duration of Action, as an Inhaled Therapy for Lung Remodeling in Pulmonary Arterial Hypertension. J Med Chem59:7901-14 (2016) 
 
Platelet-derived growth factor receptor beta
Name:Platelet-derived growth factor receptor beta
Type:PROTEIN
Mol. Mass.:122794.58
Organism:Rattus norvegicus
Description:ChEMBL_177425
Residue:1097
BDBM50191978
NameBDBM50191978
Synonyms:CHEMBL3915941
TypeSmall organic molecule
Emp. Form.C27H32N8O2
Mol. Mass.500.5954
SMILESCc1ncc(cc1NC(=O)c1cnn2cc(ccc12)-c1cnn(C)c1)C(=O)NCCN1CCCC1(C)C