Reaction Details
TargetCytochrome P450 2C9
LigandBDBM50192754
Substrate/Competitorn/a
Meas. Tech.ChEMBL_1613613 (CHEMBL3855413)
IC50 5625±n/a nM
Citation Tice, CMNoto, PBFan, KYZhao, WLotesta, SDDong, CMarcus, APZheng, YJChen, GWu, ZVan Orden, RZhou, JBukhtiyarov, YZhao, YLipinski, KHoward, LGuo, JKandpal, GMeng, SHardy, AKrosky, PGregg, RELeftheris, KMcKeever, BMSingh, SBLala, DMcGeehan, GMZhuang, LClaremon, DA Brain penetrant liver X receptor (LXR) modulators based on a 2,4,5,6-tetrahydropyrrolo[3,4-c]pyrazole core. Bioorg Med Chem Lett26:5044-5050 (2016) 
 
Cytochrome P450 2C9
Name:Cytochrome P450 2C9
Type:Enzyme
Mol. Mass.:55636.33
Organism:Homo sapiens (Human)
Description:P11712
Residue:490
BDBM50192754
NameBDBM50192754
Synonyms:CHEMBL3913348
TypeSmall organic molecule
Emp. Form.C21H24N4O3S
Mol. Mass.412.505
SMILESCOc1cc(ccn1)N1Cc2cn(nc2[C@H]1C(C)C)-c1cccc(c1)S(C)(=O)=O