Reaction Details
TargetOxysterols receptor LXR-alpha
LigandBDBM50192756
Substrate/Competitorn/a
Meas. Tech.ChEMBL_1613605 (CHEMBL3855405)
Ki 63±n/a nM
Citation Tice, CMNoto, PBFan, KYZhao, WLotesta, SDDong, CMarcus, APZheng, YJChen, GWu, ZVan Orden, RZhou, JBukhtiyarov, YZhao, YLipinski, KHoward, LGuo, JKandpal, GMeng, SHardy, AKrosky, PGregg, RELeftheris, KMcKeever, BMSingh, SBLala, DMcGeehan, GMZhuang, LClaremon, DA Brain penetrant liver X receptor (LXR) modulators based on a 2,4,5,6-tetrahydropyrrolo[3,4-c]pyrazole core. Bioorg Med Chem Lett26:5044-5050 (2016) 
 
Oxysterols receptor LXR-alpha
Name:Oxysterols receptor LXR-alpha
Type:Enzyme Catalytic Domain
Mol. Mass.:50403.85
Organism:Homo sapiens (Human)
Description:Q13133
Residue:447
BDBM50192756
NameBDBM50192756
Synonyms:CHEMBL3932169
TypeSmall organic molecule
Emp. Form.C21H22F3N5O3S
Mol. Mass.481.491
SMILESCC(C)[C@H]1N(Cc2cn(nc12)-c1cccc(c1)S(C)(=O)=O)c1ncc(CO)c(n1)C(F)(F)F