Reaction Details
TargetCoagulation factor X
LigandBDBM50192767
Substrate/Competitorn/a
Meas. Tech.ChEMBL_1613696 (CHEMBL3855496)
Ki 1800±n/a nM
Citation Ladziata, VUGlunz, PWZou, YZhang, XJiang, WJacutin-Porte, SCheney, DLWei, ALuettgen, JMHarper, TMWong, PCSeiffert, DWexler, RRPriestley, ES Synthesis and P1' SAR exploration of potent macrocyclic tissue factor-factor VIIa inhibitors. Bioorg Med Chem Lett26:5051-5057 (2016) 
 
Coagulation factor X
Name:Coagulation factor X
Type:Enzyme
Mol. Mass.:54726.60
Organism:Homo sapiens (Human)
Description:n/a
Residue:488
BDBM50192767
NameBDBM50192767
Synonyms:CHEMBL3984725
TypeSmall organic molecule
Emp. Form.C36H38FN5O5
Mol. Mass.639.7158
SMILESC[C@H]1COC(=O)Nc2ccc(c(CN(C)C(=O)[C@H](Nc3ccc4c(N)ncc(F)c4c3)c3ccc1c(C)c3)c2)C1(CCCC1)C(O)=O