Reaction Details
TargetVitamin K-dependent protein C
LigandBDBM50192765
Substrate/Competitorn/a
Meas. Tech.ChEMBL_1613700 (CHEMBL3855500)
Ki 1600±n/a nM
Citation Ladziata, VUGlunz, PWZou, YZhang, XJiang, WJacutin-Porte, SCheney, DLWei, ALuettgen, JMHarper, TMWong, PCSeiffert, DWexler, RRPriestley, ES Synthesis and P1' SAR exploration of potent macrocyclic tissue factor-factor VIIa inhibitors. Bioorg Med Chem Lett26:5051-5057 (2016) 
 
Vitamin K-dependent protein C
Name:Vitamin K-dependent protein C
Type:Enzyme
Mol. Mass.:52067.73
Organism:Homo sapiens (Human)
Description:n/a
Residue:461
BDBM50192765
NameBDBM50192765
Synonyms:CHEMBL3895930
TypeSmall organic molecule
Emp. Form.C36H38FN5O6
Mol. Mass.655.7152
SMILESC[C@H]1COC(=O)Nc2ccc(c(CN(C)C(=O)[C@H](Nc3ccc4c(N)ncc(F)c4c3)c3ccc1c(C)c3)c2)C1(CCOCC1)C(O)=O