Reaction Details
TargetProthrombin
LigandBDBM50192770
Substrate/Competitorn/a
Meas. Tech.ChEMBL_1613697 (CHEMBL3855497)
Ki>13300±n/a nM
Citation Ladziata, VUGlunz, PWZou, YZhang, XJiang, WJacutin-Porte, SCheney, DLWei, ALuettgen, JMHarper, TMWong, PCSeiffert, DWexler, RRPriestley, ES Synthesis and P1' SAR exploration of potent macrocyclic tissue factor-factor VIIa inhibitors. Bioorg Med Chem Lett26:5051-5057 (2016) 
 
Prothrombin
Name:Prothrombin
Type:Protein
Mol. Mass.:70029.57
Organism:Homo sapiens (Human)
Description:P00734
Residue:622
BDBM50192770
NameBDBM50192770
Synonyms:CHEMBL3956096
TypeSmall organic molecule
Emp. Form.C37H40FN5O5
Mol. Mass.653.7424
SMILESC[C@H]1COC(=O)Nc2ccc(c(CN(C)C(=O)[C@H](Nc3ccc4c(N)ncc(F)c4c3)c3ccc1c(C)c3)c2)C1(CCCCC1)C(O)=O