Reaction Details
TargetPhosphatidylinositol 4,5-bisphosphate 3-kinase catalytic subunit gamma isoform
LigandBDBM50193030
Substrate/Competitorn/a
Meas. Tech.ChEBML_1614095
IC50 20±n/a nM
Citation Ferguson, FMNi, JZhang, TTesar, BSim, TKim, NDDeng, XBrown, JRZhao, JJGray, NS Discovery of a Series of 5,11-Dihydro-6 ACS Med Chem Lett7:908-912 (2016) 
 
Phosphatidylinositol 4,5-bisphosphate 3-kinase catalytic subunit gamma isoform
Name:Phosphatidylinositol 4,5-bisphosphate 3-kinase catalytic subunit gamma isoform
Type:Enzyme Subunit
Mol. Mass.:126470.30
Organism:Homo sapiens (Human)
Description:P48736
Residue:1102
BDBM50193030
NameBDBM50193030
Synonyms:CHEMBL3950648 | US11155556, No. 14
TypeSmall organic molecule
Emp. Form.C20H20N6O3S
Mol. Mass.424.476
SMILESCN1c2ccc(C)cc2C(=O)N(C)c2cnc(Nc3ccc(cc3)S(N)(=O)=O)nc12