Reaction Details
TargetAurora kinase B
LigandBDBM50193020
Substrate/Competitorn/a
Meas. Tech.ChEBML_1614097
IC50 130±n/a nM
Citation Ferguson, FMNi, JZhang, TTesar, BSim, TKim, NDDeng, XBrown, JRZhao, JJGray, NS Discovery of a Series of 5,11-Dihydro-6 ACS Med Chem Lett7:908-912 (2016) 
 
Aurora kinase B
Name:Aurora kinase B
Type:Protein
Mol. Mass.:39327.72
Organism:Homo sapiens (Human)
Description:Q96GD4
Residue:344
BDBM50193020
NameBDBM50193020
Synonyms:CHEMBL3907932 | US11155556, No. 7
TypeSmall organic molecule
Emp. Form.C29H27N7O4S
Mol. Mass.569.634
SMILESCN1c2ccc(C)cc2C(=O)N(C)c2cnc(Nc3cccc(c3)S(=O)(=O)Nc3cccc(NC(=O)C=C)c3)nc12