Reaction Details
TargetAurora kinase B
LigandBDBM50193025
Substrate/Competitorn/a
Meas. Tech.ChEMBL_1614097 (CHEMBL3855897)
IC50 9400±n/a nM
Citation Ferguson, FMNi, JZhang, TTesar, BSim, TKim, NDDeng, XBrown, JRZhao, JJGray, NS Discovery of a Series of 5,11-Dihydro-6 ACS Med Chem Lett7:908-912 (2016) 
 
Aurora kinase B
Name:Aurora kinase B
Type:Protein
Mol. Mass.:39327.72
Organism:Homo sapiens (Human)
Description:Q96GD4
Residue:344
BDBM50193025
NameBDBM50193025
Synonyms:CHEMBL3932938 | US11155556, No. 18
TypeSmall organic molecule
Emp. Form.C20H20N6O3S
Mol. Mass.424.476
SMILESCN1c2ccccc2C(=O)N(C)c2cnc(Nc3ccc(cc3C)S(N)(=O)=O)nc12