Reaction Details
TargetAurora kinase A
LigandBDBM50193023
Substrate/Competitorn/a
Meas. Tech.ChEMBL_1614096 (CHEMBL3855896)
IC50 270±n/a nM
Citation Ferguson, FMNi, JZhang, TTesar, BSim, TKim, NDDeng, XBrown, JRZhao, JJGray, NS Discovery of a Series of 5,11-Dihydro-6 ACS Med Chem Lett7:908-912 (2016) 
 
Aurora kinase A
Name:Aurora kinase A
Type:Serine/threonine-protein kinase
Mol. Mass.:45830.98
Organism:Homo sapiens (Human)
Description:O14965
Residue:403
BDBM50193023
NameBDBM50193023
Synonyms:CHEMBL3898901 | US11155556, No. 5
TypeSmall organic molecule
Emp. Form.C29H27N7O4S
Mol. Mass.569.634
SMILESCN1c2ccc(C)cc2C(=O)N(C)c2cnc(Nc3cccc(c3)S(=O)(=O)Nc3ccc(NC(=O)C=C)cc3)nc12