Reaction Details
TargetPhosphatidylinositol 4,5-bisphosphate 3-kinase catalytic subunit delta isoform
LigandBDBM50337135
Substrate/Competitorn/a
Meas. Tech.ChEMBL_1614094 (CHEMBL3855894)
IC50 49±n/a nM
Citation Ferguson, FMNi, JZhang, TTesar, BSim, TKim, NDDeng, XBrown, JRZhao, JJGray, NS Discovery of a Series of 5,11-Dihydro-6 ACS Med Chem Lett7:908-912 (2016) 
 
Phosphatidylinositol 4,5-bisphosphate 3-kinase catalytic subunit delta isoform
Name:Phosphatidylinositol 4,5-bisphosphate 3-kinase catalytic subunit delta isoform
Type:Enzyme Subunit
Mol. Mass.:119489.41
Organism:Homo sapiens (Human)
Description:O00329
Residue:1044
BDBM50337135
NameBDBM50337135
Synonyms:4-((5,11-dimethyl-6-oxo-6,11-dihydro-5H-benzo[e]pyrimido[5,4-b][1,4]diazepin-2-yl)amino)benzenesulfonamide CHEMBL1673047 | US11155556, No. 16
TypeSmall organic molecule
Emp. Form.C19H18N6O3S
Mol. Mass.410.45
SMILESCN1c2ccccc2C(=O)N(C)c2cnc(Nc3ccc(cc3)S(N)(=O)=O)nc12