Reaction Details
TargetPlatelet-activating factor acetylhydrolase
LigandBDBM50197657
Substrate/Competitorn/a
Meas. Tech.ChEMBL_1619619 (CHEMBL3861788)
IC50 290±n/a nM
Citation Woolford, AJDay, PJBénéton, VBerdini, VCoyle, JEDudit, YGrondin, PHuet, PLee, LYManas, ESMcMenamin, RLMurray, CWPage, LWPatel, VKPotvain, FRich, SJSang, YSomers, DOTrottet, LWan, ZZhang, X Fragment-Based Approach to the Development of an Orally Bioavailable Lactam Inhibitor of Lipoprotein-Associated Phospholipase A2 (Lp-PLA J Med Chem59:10738-10749 (2016) 
 
Platelet-activating factor acetylhydrolase
Name:Platelet-activating factor acetylhydrolase
Type:PROTEIN
Mol. Mass.:50084.41
Organism:Homo sapiens (Human)
Description:ChEMBL_156212
Residue:441
BDBM50197657
NameBDBM50197657
Synonyms:CHEMBL3939387
TypeSmall organic molecule
Emp. Form.C18H23F2NO4S
Mol. Mass.387.441
SMILESCC1(CCS(=O)(=O)CC1)C1CN(CCOc2ccc(F)c(F)c2)C(=O)C1