Reaction Details
TargetPlatelet-activating factor acetylhydrolase
LigandBDBM50197674
Substrate/Competitorn/a
Meas. Tech.ChEMBL_1619620 (CHEMBL3861789)
IC50 620±n/a nM
Citation Woolford, AJDay, PJBénéton, VBerdini, VCoyle, JEDudit, YGrondin, PHuet, PLee, LYManas, ESMcMenamin, RLMurray, CWPage, LWPatel, VKPotvain, FRich, SJSang, YSomers, DOTrottet, LWan, ZZhang, X Fragment-Based Approach to the Development of an Orally Bioavailable Lactam Inhibitor of Lipoprotein-Associated Phospholipase A2 (Lp-PLA J Med Chem59:10738-10749 (2016) 
 
Platelet-activating factor acetylhydrolase
Name:Platelet-activating factor acetylhydrolase
Type:PROTEIN
Mol. Mass.:50084.41
Organism:Homo sapiens (Human)
Description:ChEMBL_156212
Residue:441
BDBM50197674
NameBDBM50197674
Synonyms:CHEMBL3933361
TypeSmall organic molecule
Emp. Form.C20H26FN3O4
Mol. Mass.391.4365
SMILESOC=O.CC1(CCNCC1)C1CN(CCOc2ccc(F)c(c2)C#N)C(=O)C1