Reaction Details
TargetPlatelet-activating factor acetylhydrolase
LigandBDBM50125265
Substrate/Competitorn/a
Meas. Tech.ChEMBL_1619621 (CHEMBL3861790)
IC50 0.049000±n/a nM
Citation Woolford, AJDay, PJBénéton, VBerdini, VCoyle, JEDudit, YGrondin, PHuet, PLee, LYManas, ESMcMenamin, RLMurray, CWPage, LWPatel, VKPotvain, FRich, SJSang, YSomers, DOTrottet, LWan, ZZhang, X Fragment-Based Approach to the Development of an Orally Bioavailable Lactam Inhibitor of Lipoprotein-Associated Phospholipase A2 (Lp-PLA J Med Chem59:10738-10749 (2016) 
 
Platelet-activating factor acetylhydrolase
Name:Platelet-activating factor acetylhydrolase
Type:PROTEIN
Mol. Mass.:50084.41
Organism:Homo sapiens (Human)
Description:ChEMBL_156212
Residue:441
BDBM50125265
NameBDBM50125265
Synonyms:CHEMBL204021 | N-(2-Diethylamino-ethyl)-2-[2-(4-fluoro-benzylsulfanyl)-4-oxo-4,5,6,7-tetrahydro-cyclopentapyrimidin-1-yl]-N-(4'-trifluoromethyl-biphenyl-4-ylmethyl)-acetamide
TypeSmall organic molecule
Emp. Form.C36H38F4N4O2S
Mol. Mass.666.771
SMILESCCN(CC)CCN(Cc1ccc(cc1)-c1ccc(cc1)C(F)(F)F)C(=O)Cn1c2CCCc2c(=O)nc1SCc1ccc(F)cc1