Reaction Details
TargetPlatelet-activating factor acetylhydrolase
LigandBDBM50197679
Substrate/Competitorn/a
Meas. Tech.ChEMBL_1619621 (CHEMBL3861790)
IC50 14000±n/a nM
Citation Woolford, AJDay, PJBénéton, VBerdini, VCoyle, JEDudit, YGrondin, PHuet, PLee, LYManas, ESMcMenamin, RLMurray, CWPage, LWPatel, VKPotvain, FRich, SJSang, YSomers, DOTrottet, LWan, ZZhang, X Fragment-Based Approach to the Development of an Orally Bioavailable Lactam Inhibitor of Lipoprotein-Associated Phospholipase A2 (Lp-PLA J Med Chem59:10738-10749 (2016) 
 
Platelet-activating factor acetylhydrolase
Name:Platelet-activating factor acetylhydrolase
Type:PROTEIN
Mol. Mass.:50084.41
Organism:Homo sapiens (Human)
Description:ChEMBL_156212
Residue:441
BDBM50197679
NameBDBM50197679
Synonyms:CHEMBL3908555
TypeSmall organic molecule
Emp. Form.C16H19FN2O3
Mol. Mass.306.3321
SMILESFc1ccc(OCCN2C(=O)NC3(CCCCC3)C2=O)cc1