Reaction Details
TargetCannabinoid receptor 2
LigandBDBM50198695
Substrate/Competitorn/a
Meas. Tech.ChEMBL_1620883 (CHEMBL3863166)
EC50>10000±n/a nM
Citation Matthews, JMMcNally, JJConnolly, PJXia, MZhu, BBlack, SChen, CHou, CLiang, YTang, YMacielag, MJ Tetrahydroindazole derivatives as potent and peripherally selective cannabinoid-1 (CB1) receptor inverse agonists. Bioorg Med Chem Lett26:5346-5349 (2016) 
 
Cannabinoid receptor 2
Name:Cannabinoid receptor 2
Type:G Protein-Coupled Receptor (GPCR)
Mol. Mass.:39690.94
Organism:Homo sapiens (Human)
Description:P34972
Residue:360
BDBM50198695
NameBDBM50198695
Synonyms:CHEMBL3957321
TypeSmall organic molecule
Emp. Form.C31H28Cl3N5O
Mol. Mass.592.946
SMILESClc1ccc(\C=C2/CCCc3c(nn(c23)-c2ccc(Cl)cc2Cl)C(=O)NC2CCN(CC2)c2ccccn2)cc1