Reaction Details
TargetCannabinoid receptor 1
LigandBDBM50198725
Substrate/Competitorn/a
Meas. Tech.ChEMBL_1620896 (CHEMBL3863179)
EC50 32±n/a nM
Citation Zhu, BMatthews, JMXia, MBlack, SChen, CHou, CLiang, YTang, YMacielag, MJ Tetrahydropyrazolo[4,3-c]pyridine derivatives as potent and peripherally selective cannabinoid-1 (CB1) receptor inverse agonists. Bioorg Med Chem Lett26:5597-5601 (2016) 
 
Cannabinoid receptor 1
Name:Cannabinoid receptor 1
Type:G Protein-Coupled Receptor (GPCR)
Mol. Mass.:52868.96
Organism:Homo sapiens (Human)
Description:P21554
Residue:472
BDBM50198725
NameBDBM50198725
Synonyms:CHEMBL3911571
TypeSmall organic molecule
Emp. Form.C33H28Cl2N6O3
Mol. Mass.627.52
SMILESCOc1ccc(\C=C2/CN(Cc3c(nn(c23)-c2ccc(Cl)cc2Cl)C(=O)N[C@H](C)c2ccccc2)C(=O)c2cc[nH]n2)cc1