Reaction Details
TargetCannabinoid receptor 1
LigandBDBM50198727
Substrate/Competitorn/a
Meas. Tech.ChEMBL_1620896 (CHEMBL3863179)
EC50 9.0±n/a nM
Citation Zhu, BMatthews, JMXia, MBlack, SChen, CHou, CLiang, YTang, YMacielag, MJ Tetrahydropyrazolo[4,3-c]pyridine derivatives as potent and peripherally selective cannabinoid-1 (CB1) receptor inverse agonists. Bioorg Med Chem Lett26:5597-5601 (2016) 
 
Cannabinoid receptor 1
Name:Cannabinoid receptor 1
Type:G Protein-Coupled Receptor (GPCR)
Mol. Mass.:52868.96
Organism:Homo sapiens (Human)
Description:P21554
Residue:472
BDBM50198727
NameBDBM50198727
Synonyms:CHEMBL3905508
TypeSmall organic molecule
Emp. Form.C30H25Cl2FN6O3
Mol. Mass.607.462
SMILESC[C@@H](NC(=O)c1nn(c2c1CN(C\C2=C/c1ccc(F)cc1)C(=O)CC(N)=O)-c1ccc(Cl)cc1Cl)c1ccccn1