Reaction Details
TargetCannabinoid receptor 1
LigandBDBM50198736
Substrate/Competitorn/a
Meas. Tech.ChEMBL_1620896 (CHEMBL3863179)
EC50 17±n/a nM
Citation Zhu, BMatthews, JMXia, MBlack, SChen, CHou, CLiang, YTang, YMacielag, MJ Tetrahydropyrazolo[4,3-c]pyridine derivatives as potent and peripherally selective cannabinoid-1 (CB1) receptor inverse agonists. Bioorg Med Chem Lett26:5597-5601 (2016) 
 
Cannabinoid receptor 1
Name:Cannabinoid receptor 1
Type:G Protein-Coupled Receptor (GPCR)
Mol. Mass.:52868.96
Organism:Homo sapiens (Human)
Description:P21554
Residue:472
BDBM50198736
NameBDBM50198736
Synonyms:CHEMBL3977281
TypeSmall organic molecule
Emp. Form.C30H27Cl3N6O4S
Mol. Mass.673.997
SMILESC[C@@H](NC(=O)c1nn(c2c1CN(C\C2=C/c1ccc(Cl)cc1)C(=O)CNS(C)(=O)=O)-c1ccc(Cl)cc1Cl)c1ccccn1