Reaction Details
TargetAndrogen receptor
LigandBDBM50199121
Substrate/Competitorn/a
Meas. Tech.ChEMBL_1621343 (CHEMBL3863626)
IC50 68±n/a nM
Citation Jadhavar, PSRamachandran, SARiquelme, EGupta, AQuinn, KPShivakumar, DRay, SZende, DNayak, AKMiglani, SKSathe, BDRaja, MFarias, OAlfaro, IBelmar, SGuerrero, JBernales, SChakravarty, SHung, DTLindquist, JNRai, R Targeting prostate cancer with compounds possessing dual activity as androgen receptor antagonists and HDAC6 inhibitors. Bioorg Med Chem Lett26:5222-5228 (2016) 
 
Androgen receptor
Name:Androgen receptor
Type:Receptor
Mol. Mass.:99185.27
Organism:Homo sapiens (Human)
Description:CHO cells were stably transfected with human AR gene.
Residue:920
BDBM50199121
NameBDBM50199121
Synonyms:CHEMBL3908221
TypeSmall organic molecule
Emp. Form.C32H27F7N4O3S2
Mol. Mass.712.701
SMILESCC1(C)N(C(=S)N(C1=O)c1ccc(C#N)c(c1)C(F)(F)F)c1ccc(C(=O)NCCCCCCc2ccc(s2)C(=O)C(F)(F)F)c(F)c1