Reaction Details
TargetAdenosine receptor A2a
LigandBDBM50199701
Substrate/Competitorn/a
Meas. Tech.ChEMBL_1621694 (CHEMBL3863977)
IC50 41±n/a nM
Citation Grŕcia, JBuil, MACastro, JEichhorn, PFerrer, MGavaldŕ, AHernández, BSegarra, VLehner, MDMoreno, IPagčs, LRoberts, RSSerrat, JSevilla, STaltavull, JAndrés, MCabedo, JVilella, DCalama, ECarcasona, CMiralpeix, M Biphenyl Pyridazinone Derivatives as Inhaled PDE4 Inhibitors: Structural Biology and Structure-Activity Relationships. J Med Chem59:10479-10497 (2016) 
 
Adenosine receptor A2a
Name:Adenosine receptor A2a
Type:G Protein-Coupled Receptor (GPCR)
Mol. Mass.:44716.46
Organism:Homo sapiens (Human)
Description:P29274
Residue:412
BDBM50199701
NameBDBM50199701
Synonyms:CHEMBL3968147
TypeSmall organic molecule
Emp. Form.C35H41Cl2N7O4
Mol. Mass.694.651
SMILESCCn1nc(cc(NC(=O)Nc2c(Cl)cncc2Cl)c1=O)-c1cccc(c1)-c1cccc(c1)C(=O)NCCCCCCCN(C)CCO