Reaction Details
TargetcAMP-specific 3',5'-cyclic phosphodiesterase 4B
LigandBDBM50199719
Substrate/Competitorn/a
Meas. Tech.ChEMBL_1621667 (CHEMBL3863950)
IC50 0.050000±n/a nM
Citation Grŕcia, JBuil, MACastro, JEichhorn, PFerrer, MGavaldŕ, AHernández, BSegarra, VLehner, MDMoreno, IPagčs, LRoberts, RSSerrat, JSevilla, STaltavull, JAndrés, MCabedo, JVilella, DCalama, ECarcasona, CMiralpeix, M Biphenyl Pyridazinone Derivatives as Inhaled PDE4 Inhibitors: Structural Biology and Structure-Activity Relationships. J Med Chem59:10479-10497 (2016) 
 
cAMP-specific 3',5'-cyclic phosphodiesterase 4B
Name:cAMP-specific 3',5'-cyclic phosphodiesterase 4B
Type:Protein
Mol. Mass.:83318.87
Organism:Homo sapiens (Human)
Description:Q07343
Residue:736
BDBM50199719
NameBDBM50199719
Synonyms:CHEMBL3918173
TypeSmall organic molecule
Emp. Form.C32H33Cl2N7O3
Mol. Mass.634.556
SMILESCCn1nc(cc(NC(=O)Nc2c(Cl)cncc2Cl)c1=O)-c1cccc(c1)-c1cccc(c1)C(=O)NCCC1CCCN1C