Reaction Details
TargetCREB-binding protein
LigandBDBM50151661
Substrate/Competitorn/a
Meas. Tech.ChEMBL_1622032 (CHEMBL3864384)
IC50 580±n/a nM
Citation Crawford, TDRomero, FALai, KWTsui, VTaylor, AMde Leon Boenig, GNoland, CLMurray, JLy, JChoo, EFHunsaker, TLChan, EWMerchant, MKharbanda, SGascoigne, KEKaufman, SBeresini, MHLiao, JLiu, WChen, KXChen, ZConery, ARCôté, AJayaram, HJiang, YKiefer, JRKleinheinz, TLi, YMaher, JPardo, EPoy, FSpillane, KLWang, FWang, JWei, XXu, ZXu, ZYen, IZawadzke, LZhu, XBellon, SCummings, RCochran, AGAlbrecht, BKMagnuson, S Discovery of a Potent and Selective in Vivo Probe (GNE-272) for the Bromodomains of CBP/EP300. J Med Chem59:10549-10563 (2016) 
 
CREB-binding protein
Name:CREB-binding protein
Type:Transcription Coactivator
Mol. Mass.:265411.66
Organism:Homo sapiens (Human)
Description:Q92793
Residue:2442
BDBM50151661
NameBDBM50151661
Synonyms:CHEMBL3752296
TypeSmall organic molecule
Emp. Form.C23H28N4O3
Mol. Mass.408.4934
SMILESCOc1ccc2CCCN(CCCNC(=O)c3cccc4NC(=O)[C@@H](C)Nc34)c2c1