Reaction Details
TargetBromodomain-containing protein 4
LigandBDBM50200425
Substrate/Competitorn/a
Meas. Tech.ChEBML_1622038
IC50 5800±n/a nM
Citation Crawford, TDRomero, FALai, KWTsui, VTaylor, AMde Leon Boenig, GNoland, CLMurray, JLy, JChoo, EFHunsaker, TLChan, EWMerchant, MKharbanda, SGascoigne, KEKaufman, SBeresini, MHLiao, JLiu, WChen, KXChen, ZConery, ARCôté, AJayaram, HJiang, YKiefer, JRKleinheinz, TLi, YMaher, JPardo, EPoy, FSpillane, KLWang, FWang, JWei, XXu, ZXu, ZYen, IZawadzke, LZhu, XBellon, SCummings, RCochran, AGAlbrecht, BKMagnuson, S Discovery of a Potent and Selective in Vivo Probe (GNE-272) for the Bromodomains of CBP/EP300. J Med Chem59:10549-10563 (2016) 
 
Bromodomain-containing protein 4
Name:Bromodomain-containing protein 4
Type:Protein
Mol. Mass.:152264.84
Organism:Homo sapiens (Human)
Description:O60885
Residue:1362
BDBM50200425
NameBDBM50200425
Synonyms:CHEMBL3934488
TypeSmall organic molecule
Emp. Form.C22H29N5O2
Mol. Mass.395.498
SMILESCCCNC(=O)c1cccc(Nc2nn(CC3CC3)c3CCN(Cc23)C(C)=O)c1